# Maven Plugin POST but with Gradle

**URL:** <https://forum.inductiveautomation.com/t/maven-plugin-post-but-with-gradle/61879>\
**Category:** Module Development\
**Tags:** ignition81\
**Created:** [July 13, 2022, 11:52pm UTC](https://forum.inductiveautomation.com/t/maven-plugin-post-but-with-gradle/61879 "2022-07-13T23:52:34Z")\
**Posts on this page:** 1\
**Showing post:** 16

<div class="post-metadata">

**Author:** ![kgamble](https://sea1.discourse-cdn.com/inductiveautomation/user_avatar/forum.inductiveautomation.com/kgamble/32/8019_2.png) [@kgamble](https://forum.inductiveautomation.com/u/kgamble)\
**Post date:** [July 16, 2022, 12:04am UTC](https://forum.inductiveautomation.com/t/maven-plugin-post-but-with-gradle/61879/16 "2022-07-16T00:04:55Z")

</div>

All awesome info!

It looks like it’s trying to force signing the module and erroring out with no certs found, though I am never running the `signModule` task. Any idea why this is happening?

I just compiled the generator cli, and then used it to create a new module. I then added the missing section in `pluginManagement` listed on this forum post. [Gradle plugin is missing module signer - #3 by Thomas\_Mulcahy](https://forum.inductiveautomation.com/t/gradle-plugin-is-missing-module-signer/60537/3)

Then In the new module folder, I ran the build and this is what happened:

```auto
 kgamble-mbp ➜ ./gradlew build
Starting a Gradle Daemon, 1 busy and 1 incompatible and 1 stopped Daemons could not be reused, use --status for details
Required keystore file location not found. Specify via flag '--keystoreFile=<value>', or in gradle.properties file as 'ignition.signing.keystoreFile=<value>'
Required keystore file location not found. Specify via flag '--keystoreFile=<value>', or in gradle.properties file as 'ignition.signing.keystoreFile=<value>'
Required certificate file location not found. Specify via flag '--certFile=<value>', or in gradle.properties file as 'ignition.signing.certFile=<value>'
Required certificate file location not found. Specify via flag '--certFile=<value>', or in gradle.properties file as 'ignition.signing.certFile=<value>'

> Task :signModule FAILED
Required certificate file location not found. Specify via flag '--certFile=<value>', or in gradle.properties file as 'ignition.signing.certFile=<value>'
Required keystore file location not found. Specify via flag '--keystoreFile=<value>', or in gradle.properties file as 'ignition.signing.keystoreFile=<value>'
Required certificate alias not found. Specify via flag '--certAlias=<value>', or in gradle.properties file as 'ignition.signing.certAlias=<value>'
Required certificate file location not found. Specify via flag '--certFile=<value>', or in gradle.properties file as 'ignition.signing.certFile=<value>'
Required certificate password not found. Specify via flag '--certPassword=<value>', or in gradle.properties file as 'ignition.signing.certPassword=<value>'
Required keystore file location not found. Specify via flag '--keystoreFile=<value>', or in gradle.properties file as 'ignition.signing.keystoreFile=<value>'
Required keystore password not found. Specify via flag '--keystorePassword=<value>', or in gradle.properties file as 'ignition.signing.keystorePassword=<value>'

FAILURE: Build failed with an exception.

* What went wrong:
Some problems were found with the configuration of task ':signModule' (type 'SignModule').
> File '/Users/kgamble/Work/Ignition/Modules/test-module/test/null' specified for property 'certFile' does not exist.
> File '/Users/kgamble/Work/Ignition/Modules/test-module/test/null' specified for property 'keystore' does not exist.

* Try:
Run with --stacktrace option to get the stack trace. Run with --info or --debug option to get more log output. Run with --scan to get full insights.

* Get more help at https://help.gradle.org

Deprecated Gradle features were used in this build, making it incompatible with Gradle 7.0.
Use '--warning-mode all' to show the individual deprecation warnings.
See https://docs.gradle.org/6.8.2/userguide/command_line_interface.html#sec:command_line_warnings

BUILD FAILED in 59s
16 actionable tasks: 16 executed

```

---

_[View the full topic](https://forum.inductiveautomation.com/t/maven-plugin-post-but-with-gradle/61879)._
