# Missing Dependancies

**URL:** <https://forum.inductiveautomation.com/t/missing-dependancies/22652>\
**Category:** Module Development\
**Created:** [February 18, 2019, 8:09pm UTC](https://forum.inductiveautomation.com/t/missing-dependancies/22652 "2019-02-18T20:09:20Z")\
**Posts on this page:** 5\
**Page:** 1

<div class="post-metadata">

**Author:** ![grietveld](https://sea1.discourse-cdn.com/inductiveautomation/user_avatar/forum.inductiveautomation.com/grietveld/32/6984_2.png) [@grietveld](https://forum.inductiveautomation.com/u/grietveld)\
**Post date:** [February 18, 2019, 8:09pm UTC](https://forum.inductiveautomation.com/t/missing-dependancies/22652/1 "2019-02-18T20:09:20Z")

</div>

I’m just trying to explore and understand the SDK a bit for future use, but I’m running into issues compiling the examples. The error looks very similar to the one [here](http://forum.inductiveautomation.com/t/missing-dependencies/20047), but the information listed there doesn’t seem to match.

I’m probably missing something obvious, but I’m a little rusty in eclipse and haven’t used Maven previously.

Any help would be appreciated.

```auto
[INFO] Scanning for projects...
[INFO] 
[INFO] ---------< com.inductiveautomation.ignition.examples:ce-build >---------
[INFO] Building ce-build 1.8.0
[INFO] --------------------------------[jar]---------------------------------
[INFO] Downloading from : https://nexus.inductiveautomation.com/repository/inductiveautomation-releases/com/inductiveautomation/ignition/examples/ce-client/1.8.0/ce-client-1.8.0.pom
[INFO] Downloading from : https://nexus.inductiveautomation.com/repository/inductiveautomation-thirdparty/com/inductiveautomation/ignition/examples/ce-client/1.8.0/ce-client-1.8.0.pom
[WARNING] The POM for com.inductiveautomation.ignition.examples:ce-client:jar:1.8.0 is missing, no dependency information available
[INFO] Downloading from : https://nexus.inductiveautomation.com/repository/inductiveautomation-releases/com/inductiveautomation/ignition/examples/ce-designer/1.8.0/ce-designer-1.8.0.pom
[INFO] Downloading from : https://nexus.inductiveautomation.com/repository/inductiveautomation-thirdparty/com/inductiveautomation/ignition/examples/ce-designer/1.8.0/ce-designer-1.8.0.pom
[WARNING] The POM for com.inductiveautomation.ignition.examples:ce-designer:jar:1.8.0 is missing, no dependency information available
[INFO] Downloading from : https://nexus.inductiveautomation.com/repository/inductiveautomation-releases/com/inductiveautomation/ignition/examples/ce-client/1.8.0/ce-client-1.8.0.jar
[INFO] Downloading from : https://nexus.inductiveautomation.com/repository/inductiveautomation-releases/com/inductiveautomation/ignition/examples/ce-designer/1.8.0/ce-designer-1.8.0.jar
[INFO] Downloading from : https://nexus.inductiveautomation.com/repository/inductiveautomation-thirdparty/com/inductiveautomation/ignition/examples/ce-client/1.8.0/ce-client-1.8.0.jar
[INFO] Downloading from : https://nexus.inductiveautomation.com/repository/inductiveautomation-thirdparty/com/inductiveautomation/ignition/examples/ce-designer/1.8.0/ce-designer-1.8.0.jar
[INFO] ------------------------------------------------------------------------
[INFO] BUILD FAILURE
[INFO] ------------------------------------------------------------------------
[INFO] Total time: 2.810 s
[INFO] Finished at: 2019-02-18T15:05:14-05:00
[INFO] ------------------------------------------------------------------------
[ERROR] Failed to execute goal on project ce-build: Could not resolve dependencies for project com.inductiveautomation.ignition.examples:ce-build:jar:1.8.0: The following artifacts could not be resolved: com.inductiveautomation.ignition.examples:ce-client:jar:1.8.0, com.inductiveautomation.ignition.examples:ce-designer:jar:1.8.0: Could not find artifact com.inductiveautomation.ignition.examples:ce-client:jar:1.8.0 in releases (https://nexus.inductiveautomation.com/repository/inductiveautomation-releases) -> [Help 1]
[ERROR] 
[ERROR] To see the full stack trace of the errors, re-run Maven with the -e switch.
[ERROR] Re-run Maven using the -X switch to enable full debug logging.
[ERROR] 
[ERROR] For more information about the errors and possible solutions, please read the following articles:
[ERROR] [Help 1] http://cwiki.apache.org/confluence/display/MAVEN/DependencyResolutionException

```

---

<div class="post-metadata">

**Author:** ![Kevin.Herron](https://sea1.discourse-cdn.com/inductiveautomation/user_avatar/forum.inductiveautomation.com/kevin.herron/32/7259_2.png) [@Kevin.Herron](https://forum.inductiveautomation.com/u/Kevin.Herron)\
**Post date:** [February 18, 2019, 8:48pm UTC](https://forum.inductiveautomation.com/t/missing-dependancies/22652/2 "2019-02-18T20:48:12Z")

</div>

What command were you trying to run and where did you run it from?

---

<div class="post-metadata">

**Author:** ![grietveld](https://sea1.discourse-cdn.com/inductiveautomation/user_avatar/forum.inductiveautomation.com/grietveld/32/6984_2.png) [@grietveld](https://forum.inductiveautomation.com/u/grietveld)\
**Post date:** [February 18, 2019, 8:53pm UTC](https://forum.inductiveautomation.com/t/missing-dependancies/22652/3 "2019-02-18T20:53:06Z")

</div>

I was following the instructions found [here](https://docs.inductiveautomation.com/display/SE/Setting+up+your+Eclipse+Environment).

So I am running ‘package’ on ce-build as shown below.

 ![image](https://us1.discourse-cdn.com/inductiveautomation/original/2X/c/c52ae64d80f2092b9f960971ff3bfc303a43030d.png)

---

<div class="post-metadata">

**Author:** ![Kevin.Herron](https://sea1.discourse-cdn.com/inductiveautomation/user_avatar/forum.inductiveautomation.com/kevin.herron/32/7259_2.png) [@Kevin.Herron](https://forum.inductiveautomation.com/u/Kevin.Herron)\
**Post date:** [February 18, 2019, 8:54pm UTC](https://forum.inductiveautomation.com/t/missing-dependancies/22652/4 "2019-02-18T20:54:55Z")

</div>

I don’t know anything about that Eclipse UI, but the examples are meant for you to run `mvn package` from the example root (the ComponentExample folder in this case), not the build module.

---

<div class="post-metadata">

**Author:** ![grietveld](https://sea1.discourse-cdn.com/inductiveautomation/user_avatar/forum.inductiveautomation.com/grietveld/32/6984_2.png) [@grietveld](https://forum.inductiveautomation.com/u/grietveld)\
**Post date:** [February 18, 2019, 8:58pm UTC](https://forum.inductiveautomation.com/t/missing-dependancies/22652/5 "2019-02-18T20:58:27Z")

</div>

Nevermind, missed a step when re-running it from ComponentExample.

Thanks Kevin
