# Missing dependencies

**URL:** <https://forum.inductiveautomation.com/t/missing-dependencies/20047>\
**Category:** Module Development\
**Tags:** sdk\
**Created:** [October 9, 2018, 5:56pm UTC](https://forum.inductiveautomation.com/t/missing-dependencies/20047 "2018-10-09T17:56:53Z")\
**Posts on this page:** 8\
**Page:** 1

<div class="post-metadata">

**Author:** ![chasondeshotel](https://sea1.discourse-cdn.com/inductiveautomation/user_avatar/forum.inductiveautomation.com/chasondeshotel/32/20032_2.png) [@chasondeshotel](https://forum.inductiveautomation.com/u/chasondeshotel)\
**Post date:** [October 9, 2018, 5:56pm UTC](https://forum.inductiveautomation.com/t/missing-dependencies/20047/1 "2018-10-09T17:56:53Z")

</div>

Hello,

I’ve taken the ComponentExample from the GitHub page and attempted to install dependencies with Maven and get the following error:

```auto
Could not resolve dependencies for project com.inductiveautomation.ignition.examples:client-launcher:pom:1.8.0:
The following artifacts could not be resolved: com.inductiveautomation.ignitionsdk:client-api:jar:7.9.3
, com.inductiveautomation.ignitionsdk:vision-client-api:jar:7.9.3: 
Could not find artifact com.inductiveautomation.ignitionsdk:client-api:jar:7.9.3 in releases 
(https://nexus.inductiveautomation.com/repository/inductiveautomation-releases)

```

Anyone have any ideas? Thanks

---

<div class="post-metadata">

**Author:** ![Kevin.Herron](https://sea1.discourse-cdn.com/inductiveautomation/user_avatar/forum.inductiveautomation.com/kevin.herron/32/7259_2.png) [@Kevin.Herron](https://forum.inductiveautomation.com/u/Kevin.Herron)\
**Post date:** [October 9, 2018, 6:06pm UTC](https://forum.inductiveautomation.com/t/missing-dependencies/20047/2 "2018-10-09T18:06:10Z")

</div>

Give it another try, we had Nexus down for maintenance on and off this morning. Use the `-U` flag to force updates.

---

<div class="post-metadata">

**Author:** ![chasondeshotel](https://sea1.discourse-cdn.com/inductiveautomation/user_avatar/forum.inductiveautomation.com/chasondeshotel/32/20032_2.png) [@chasondeshotel](https://forum.inductiveautomation.com/u/chasondeshotel)\
**Post date:** [October 10, 2018, 3:21pm UTC](https://forum.inductiveautomation.com/t/missing-dependencies/20047/3 "2018-10-10T15:21:40Z")

</div>

I’m still getting the same error. If I hit the URL it’s pointed to, it redirects me to [https://nexus.inductiveautomation.com/#browse/browse:inductiveautomation-releases](https://nexus.inductiveautomation.com/#browse/browse:inductiveautomation-releases), which shows no releases

```auto
[ERROR] Failed to execute goal on project client-launcher: Could not resolve dependencies for project 
com.inductiveautomation.ignition.examples:client-launcher:pom:1.8.0: The following artifacts could not be resolved: 
com.inductiveautomation.ignitionsdk:client-api:jar:7.9.3, com.inductiveautomation.ignitionsdk:vision-client-api:jar:7.9.3: 
Could not find artifact com.inductiveautomation.ignitionsdk:client-api:jar:7.9.3 in releases 
(https://nexus.inductiveautomation.com/repository/inductiveautomation-releases)

```

---

<div class="post-metadata">

**Author:** ![PerryAJ](https://sea1.discourse-cdn.com/inductiveautomation/user_avatar/forum.inductiveautomation.com/perryaj/32/3281_2.png) [@PerryAJ](https://forum.inductiveautomation.com/u/PerryAJ)\
**Post date:** [October 10, 2018, 3:30pm UTC](https://forum.inductiveautomation.com/t/missing-dependencies/20047/4 "2018-10-10T15:30:07Z")

</div>

Thanks for the followup - we’re looking into this.

Are you having the same issue with other examples?

---

<div class="post-metadata">

**Author:** ![chasondeshotel](https://sea1.discourse-cdn.com/inductiveautomation/user_avatar/forum.inductiveautomation.com/chasondeshotel/32/20032_2.png) [@chasondeshotel](https://forum.inductiveautomation.com/u/chasondeshotel)\
**Post date:** [October 10, 2018, 3:52pm UTC](https://forum.inductiveautomation.com/t/missing-dependencies/20047/5 "2018-10-10T15:52:42Z")

</div>

Just tried it on ModbusDriverExample and it’s croaking on something else

```auto
[INFO] ------------------------------------------------------------------------
[INFO] Reactor Summary:
[INFO]
[INFO] modbus-driver-example .............................. SUCCESS [0.829 s]
[INFO] mde-gateway ........................................ SUCCESS [57.907 s]
[INFO] mde-build .......................................... FAILURE [0.652 s]
[INFO] ------------------------------------------------------------------------
[INFO] BUILD FAILURE
[INFO] ------------------------------------------------------------------------
[INFO] Total time: 59.782 s
[INFO] Finished at: 2018-10-10T15:50:43Z
[INFO] Final Memory: 17M/77M
[INFO] ------------------------------------------------------------------------
[ERROR] Failed to execute goal on project mde-build: Could not resolve dependencies for project 
com.inductiveautomation.ignition.examples:mde-build:jar:1.8.0: Could not find artifact 
com.inductiveautomation.ignition.examples:mde-gateway:jar:1.8.0 in releases (https://nexus.inductiveautomation.com
/repository/inductiveautomation-releases) -> [Help 1]

```

---

<div class="post-metadata">

**Author:** ![PerryAJ](https://sea1.discourse-cdn.com/inductiveautomation/user_avatar/forum.inductiveautomation.com/perryaj/32/3281_2.png) [@PerryAJ](https://forum.inductiveautomation.com/u/PerryAJ)\
**Post date:** [October 10, 2018, 4:07pm UTC](https://forum.inductiveautomation.com/t/missing-dependencies/20047/6 "2018-10-10T16:07:14Z")

</div>

I just checked out the example modules in a clean new windows VM with no cache, connecting from a typical public wifi connection and was able to install git, maven and java, clone the example repo, and build both examples without any errors.

Is there anything unusual about your internet connection? Firewall that might be blocking something?

Can you enumerate the exact steps you are taking to build and where you are running the commands?

edit: the fact that it’s trying to resolve jars for the local project is odd. Are you running the `mvn package` at the root of the example module? (meaning in `./ComponentExample/mvn package`, not `./ComponentExample/ce-build/mvn package`)

---

<div class="post-metadata">

**Author:** ![chasondeshotel](https://sea1.discourse-cdn.com/inductiveautomation/user_avatar/forum.inductiveautomation.com/chasondeshotel/32/20032_2.png) [@chasondeshotel](https://forum.inductiveautomation.com/u/chasondeshotel)\
**Post date:** [October 10, 2018, 4:14pm UTC](https://forum.inductiveautomation.com/t/missing-dependencies/20047/7 "2018-10-10T16:14:01Z")

</div>

`mvn package` does the trick. I was running `mvn dependency:resolve`

Thanks!

---

<div class="post-metadata">

**Author:** ![Kevin.Herron](https://sea1.discourse-cdn.com/inductiveautomation/user_avatar/forum.inductiveautomation.com/kevin.herron/32/7259_2.png) [@Kevin.Herron](https://forum.inductiveautomation.com/u/Kevin.Herron)\
**Post date:** [October 10, 2018, 8:31pm UTC](https://forum.inductiveautomation.com/t/missing-dependencies/20047/8 "2018-10-10T20:31:56Z")

</div>

A post was split to a new topic: [Can’t Resolve Import](https://forum.inductiveautomation.com/t/cant-resolve-import/20075)
